{"text_format":"1","workbook":"xlsx","n_sheets":4,"sheets":["案内ガイド","65歳①","65歳②","65歳③"],"not_rendered":{"charts":0,"images":7,"macros":1,"external_links":0,"defined_names":1,"comments":0,"pivot_tables":0},"unopened":[],"bounds":{"document_bytes":16777216,"sheet_cells":100000,"rows_first":2000,"rows_last":500,"rows_between":2000,"halvings":0,"cell_chars":16384,"cell_head_chars":4096},"cells_cut":0,"cells_raw":0,"read":"whole","date_system":"1900"}

{"sheet":"案内ガイド","index":0,"n_rows":13,"n_cols":3,"rows_kept":13,"cut":false,"hidden":false,"merged":[[0,0,0,3]]}
["※次のいずれかの該当する欄に「１」を入力し「決定」ボタンをクリックしてください。"]
[]
["①　今年度","「60歳」になる"]
[null,"(S38.4.2～S39.4.1生れの方)"]
[]
["②　今年度","女性で「62歳」になる"]
[null,"(S36.4.2～S37.4.1生れの方)"]
[]
["③　今年度","男性で「64歳」になる"]
[null,"(S34.4.2～S35.4.1生れの方)"]
[]
["③　今年度","「65歳」になる",1]
[null,"(S34.4.2～S35.4.1生れの方)"]

{"sheet":"65歳①","index":1,"n_rows":23,"n_cols":15,"rows_kept":23,"cut":false,"hidden":false,"merged":[[3,8,3,14],[4,8,4,9]]}
[null,"【世帯の状況】"]
[null,null,null,null,null,"（※黄色の箇所を入力してください。）"]
["⑴","あなたの６５歳の誕生月と性別を入力してください。",null,null,null,null,null,"⑶　あなたの家計の状態を入力してみましょう。"]
[null,"（ただし、「１日」が誕生日の場合は、誕生月の「前月」を入力してください。）",null,null,null,null,null,null,"（参考）家計調査年報（家計収支編）（総務省統計局：http://www.stat.go.jp/data/kakei/npsf.html）を加工して作成"]
["　①","あなたの誕生月",12,"月",null,null,null,"自分の家の家計","夫婦無職世帯年間生活費平均",null,"2018年","2019年","2020年","2021年","2022年"]
["②","あなたの性別は",1,null,null,null,null,null,"公的年金等",{"$f":"AVERAGE(K6:O6)","v":215529.4},203824,216910,219976,216519,220418]
[null,"（※男性「１」、女性「２」を入力してください。）",null,null,null,null,null,null,"賃金他",{"$f":"AVERAGE(K7:O7)","v":24464.2},19011,20750,36685,20056,25819]
["⑵","あなたには配偶者がいますか？",null,null,null,null,null,null,"税・保険料",{"$f":"AVERAGE(K8:O8)","v":30742},29092,30982,31160,30664,31812]
[null,"（※配偶者がいない場合は、「決定」をクリックして次へ進んでください。）",null,null,null,null,null,{"$f":"H6+H7-H8","v":0},"可処分所得",209251.6,193743,206678,225501,205911,214425]
["①","配偶者がいる？",1,null,null,null,null,231973,"食料",{"$f":"AVERAGE(K10:O10)","v":66229.2},65319,66458,65804,65789,67776]
[null,"（※配偶者がいる場合は「１」を入力してください。）",null,null,null,null,null,null,"住居",{"$f":"AVERAGE(K11:O11)","v":14768.8},13625,13625,14518,16498,15578]
["②","配偶者の性別は？",2,null,null,null,null,null,"水道・光熱",20368,19905,19983,19845,19496,22611]
[null,"（※男性「１」、女性「２」を入力してください。）",null,null,null,null,null,null,"家具・家事用品",10109.6,9385,10100,10258,10434,10371]
["③","配偶者の年齢は今年の誕生日で何歳になりますか？",null,null,null,null,null,null,"被服・履物",5395.8,6171,6065,4699,5041,5003]
[null,null,58,"歳（54歳～70歳で入力してください。）",null,null,null,null,"保健・医療",15768.2,15181,15759,16057,16163,15681]
{"$rows_left_out":9}
{"sheet":"65歳②","index":2,"n_rows":57,"n_cols":19,"rows_kept":57,"cut":false,"hidden":false,"merged":[[18,16,18,17],[36,12,36,13],[31,0,31,6],[33,8,33,10],[45,0,45,5]]}
[null,"【年金の状況と今後の希望】",null,null,null,null,null,"（※黄色の箇所を入力してください。）"]
["⑴","あなたの年金額を入力してください。",null,null,null,null,null,"⑵ 配偶者の年金額を入力してください。"]
["（※可能なら「年金定期便」にある「６５歳」時点の見込額を入力しましょう。）",null,null,null,null,null,null,"（※可能なら「年金定期便」にある「６５歳」時点の見込額も入力しましょう。）"]
[null,null,null,"６５歳時点",null,null,null,null,null,"65歳未満",null,"65歳以上"]
["➊","老齢基礎年金",null,777800,"円",null,null,"➊老齢基礎年金（又は定額部分の額）",null,0,"円",777800,"円"]
[null,null,null,null,null,"報酬比例計",null,null,"報酬比例計",null,null,null,null,"報酬比例計"]
["❷","老齢厚生年金",null,{"$f":"D8+D9+D11+D12+D13+D15+D16+D17","v":1205600},"円",{"$f":"D8+D11+D15","v":1200000},null,"❷老齢厚生年金",{"$f":"J8+J11+J15","v":835000},{"$f":"J8+J9+J11+J12+J13+J15+J16+J17","v":835000},"円",{"$f":"L8+L9+L11+L12+L13+L15+L16+L17","v":1202400},"円",{"$f":"L8+L11+L15","v":1200000}]
[null,"①一般厚生年金","報酬比例部分",1200000,"円","経過加算計",null,"①一般厚生年金","報酬比例部分",835000,"円",1200000,"円","経過加算計"]
[null,null,"経過的加算部分",5600,"円",{"$f":"D9+D12+D13+D16+D17","v":5600},null,null,"経過的加算部分",null,"円",2400,"円",{"$f":"L9+L12+L13+L16+L17","v":2400}]
[]
[null,"②公務員厚生年金","報酬比例部分",0,"円",null,null,"②公務員厚生年金","報酬比例部分",null,"円",0,"円"]
[null,null,"経過的加算部分",0,"円",null,null,null,"経過的加算部分",null,"円",0,"円"]
[null,null,"経過的職域加算額（共済年金）",0,"円",null,null,null,"経過的職域加算額（共済年金）",null,"円",0,"円"]
[]
[null,"③私学共済厚生年金","報酬比例部分",0,"円",null,null,"③私学共済厚生年金","報酬比例部分",null,"円",0,"円"]
{"$rows_left_out":43}
{"sheet":"65歳③","index":3,"n_rows":50,"n_cols":31,"rows_kept":50,"cut":false,"hidden":false,"merged":[[32,20,32,21],[32,22,32,23],[32,24,32,25],[32,26,32,27],[33,1,33,3],[33,4,33,5],[33,6,33,7],[33,8,33,9],[33,10,33,11],[33,12,33,13],[33,14,33,15],[33,16,33,17],[33,18,33,19],[33,20,33,21],[33,22,33,23],[33,24,33,25],[33,26,33,27],[32,1,32,3],[32,4,32,5],[32,6,32,7],[32,8,32,9],[32,10,32,11],[32,12,32,13],[32,14,32,15],[32,16,32,17],[32,18,32,19],[10,26,10,27],[42,26,42,27],[40,1,40,3],[38,4,38,5],[38,6,38,7],[46,1,46,3],[38,26,38,27],[40,4,40,5],[40,6,40,7],[40,8,40,9],[40,10,40,11],[40,12,40,13],[40,14,40,15],[40,16,40,17],[40,18,40,19],[40,20,40,21],[40,22,40,23],[40,24,40,25],[40,26,40,27],[38,8,38,9],[38,10,38,11],[38,12,38,13],[38,14,38,15],[38,16,38,17],[38,18,38,19],[41,1,41,3],[43,1,43,3],[44,1,44,3],[38,1,38,3],[42,4,42,5],[42,6,42,7],[42,8,42,9],[42,10,42,11],[44,10,44,11],[42,0,42,3],[27,26,27,27],[36,1,36,3],[37,1,37,3],[35,1,35,3],[36,4,36,5],[36,6,36,7],[36,8,36,9],[36,10,36,11],[36,12,36,13],[36,14,36,15],[36,16,36,17],[36,18,36,19],[36,20,36,21],[36,22,36,23],[36,24,36,25],[36,26,36,27],[37,4,37,5],[37,6,37,7],[37,8,37,9],[37,10,37,11],[37,12,37,13],[37,14,37,15],[37,16,37,17],[37,18,37,19],[27,8,27,9],[27,10,27,11],[27,12,27,13],[27,14,27,15],[27,16,27,17],[27,18,27,19],[27,20,27,21],[27,22,27,23],[27,24,27,25],[17,24,17,25],[17,26,17,27],[11,26,11,27],[16,1,16,3],[17,1,17,3],[16,4,16,5],[16,6,16,7],[16,8,16,9],[16,10,16,11],[16,12,16,13],[16,14,16,15],[16,16,16,17],[16,18,16,19],[16,20,16,21],[16,22,16,23],[16,24,16,25],[16,26,16,27],[17,4,17,5],[17,6,17,7],[17,8,17,9],[17,10,17,11],[17,12,17,13],[17,14,17,15],[17,18,17,19],[17,20,17,21],[43,22,43,23],[43,24,43,25],[43,26,43,27],[15,18,15,19],[15,20,15,21],[43,4,43,5],[43,6,43,7],[43,8,43,9],[43,10,43,11],[43,12,43,13],[43,14,43,15],[43,16,43,17],[43,18,43,19],[43,20,43,21],[23,20,23,21],[23,22,23,23],[23,24,23,25],[23,26,23,27],[24,8,24,9],[24,10,24,11],[24,12,24,13],[17,22,17,23],[24,20,24,21],[15,1,15,3],[15,4,15,5],[15,6,15,7],[15,8,15,9],[15,10,15,11],[15,12,15,13],[19,2,19,3],[15,14,15,15],[15,16,15,17],[17,16,17,17],[9,16,9,17],[9,18,9,19],[9,20,9,21],[9,22,9,23],[9,24,9,25],[12,14,12,15],[12,16,12,17],[12,18,12,19],[12,20,12,21],[12,22,12,23],[11,14,11,15],[11,16,11,17],[11,18,11,19],[11,20,11,21],[11,22,11,23],[11,24,11,25],[10,14,10,15],[10,16,10,17],[10,18,10,19],[10,20,10,21],[10,22,10,23],[10,24,10,25],[1,2,1,3],[12,1,12,3],[13,1,13,3],[9,4,9,5],[9,6,9,7],[7,1,7,3],[7,4,7,5],[7,6,7,7],[5,4,5,5],[5,6,5,7],[2,4,2,5],[2,6,2,7],[6,1,6,3],[6,4,6,5],[6,6,6,7],[11,1,11,3],[11,4,11,5],[11,6,11,7],[10,1,10,3],[10,4,10,5],[10,6,10,7],[9,8,9,9],[12,4,12,5],[12,6,12,7],[12,8,12,9],[13,14,13,15],[13,4,13,5],[13,6,13,7],[13,8,13,9],[13,10,13,11],[13,12,13,13],[9,10,9,11],[9,12,9,13],[12,10,12,11],[12,12,12,13],[9,14,9,15],[11,8,11,9],[11,10,11,11],[11,12,11,13],[10,8,10,9],[10,10,10,11],[10,12,10,13],[7,22,7,23],[6,24,6,25],[6,20,6,21],[6,22,6,23],[2,26,2,27],[5,26,5,27],[6,26,6,27],[7,26,7,27],[6,8,6,9],[6,10,6,11],[6,12,6,13],[6,14,6,15],[6,16,6,17],[6,18,6,19],[5,20,5,21],[5,22,5,23],[5,24,5,25],[9,26,9,27],[7,8,7,9],[7,10,7,11],[7,12,7,13],[2,22,2,23],[2,24,2,25],[5,8,5,9],[5,10,5,11],[5,12,5,13],[5,14,5,15],[2,16,2,17],[2,18,2,19],[2,20,2,21],[2,8,2,9],[2,10,2,11],[2,12,2,13],[2,14,2,15],[7,24,7,25],[5,16,5,17],[5,18,5,19],[7,14,7,15],[7,16,7,17],[7,18,7,19],[7,20,7,21],[12,26,12,27],[13,26,13,27],[15,26,15,27],[23,1,23,3],[24,1,24,3],[22,8,22,9],[22,10,22,11],[22,12,22,13],[22,14,22,15],[22,16,22,17],[22,18,22,19],[22,20,22,21],[22,22,22,23],[22,24,22,25],[22,26,22,27],[23,8,23,9],[13,16,13,17],[13,18,13,19],[13,20,13,21],[13,22,13,23],[13,24,13,25],[12,24,12,25],[15,22,15,23],[15,24,15,25],[28,1,28,3],[29,1,29,3],[31,1,31,3],[22,4,22,5],[22,6,22,7],[23,4,23,5],[23,6,23,7],[26,4,26,5],[26,6,26,7],[28,4,28,5],[28,6,28,7],[29,4,29,5],[29,6,29,7],[31,4,31,5],[31,6,31,7],[30,4,30,5],[24,4,24,5],[24,6,24,7],[27,1,27,3],[27,4,27,5],[27,6,27,7],[24,22,24,23],[24,24,24,25],[24,26,24,27],[23,10,23,11],[23,12,23,13],[23,14,23,15],[23,16,23,17],[23,18,23,19],[24,14,24,15],[24,16,24,17],[24,18,24,19],[26,18,26,19],[26,20,26,21],[26,22,26,23],[26,24,26,25],[26,26,26,27],[26,8,26,9],[26,10,26,11],[26,12,26,13],[26,14,26,15],[26,16,26,17],[28,18,28,19],[28,20,28,21],[28,22,28,23],[28,24,28,25],[28,26,28,27],[28,8,28,9],[28,10,28,11],[28,12,28,13],[28,14,28,15],[28,16,28,17],[29,18,29,19],[29,20,29,21],[29,22,29,23],[29,24,29,25],[29,26,29,27],[29,8,29,9],[29,10,29,11],[29,12,29,13],[29,14,29,15],[29,16,29,17],[44,24,44,25],[35,10,35,11],[35,12,35,13],[31,18,31,19],[31,20,31,21],[31,22,31,23],[31,24,31,25],[31,26,31,27],[31,8,31,9],[31,10,31,11],[31,12,31,13],[31,14,31,15],[31,16,31,17],[37,20,37,21],[37,22,37,23],[37,24,37,25],[37,26,37,27],[42,12,42,13],[42,14,42,15],[42,16,42,17],[42,18,42,19],[42,20,42,21],[42,22,42,23],[42,24,42,25],[35,26,35,27],[41,4,41,5],[41,6,41,7],[41,8,41,9],[41,10,41,11],[41,12,41,13],[41,14,41,15],[41,16,41,17],[41,18,41,19],[41,20,41,21],[41,22,41,23],[41,24,41,25],[41,26,41,27],[35,14,35,15],[35,16,35,17],[35,18,35,19],[35,20,35,21],[35,22,35,23],[35,4,35,5],[35,6,35,7],[35,8,35,9],[38,20,38,21],[38,22,38,23],[38,24,38,25],[14,18,14,19],[44,26,44,27],[46,4,46,5],[46,6,46,7],[46,8,46,9],[46,10,46,11],[46,12,46,13],[46,14,46,15],[46,16,46,17],[46,18,46,19],[46,20,46,21],[46,22,46,23],[46,24,46,25],[46,26,46,27],[44,14,44,15],[44,16,44,17],[44,18,44,19],[44,20,44,21],[44,22,44,23],[44,4,44,5],[44,6,44,7],[44,8,44,9],[44,12,44,13],[35,24,35,25],[14,20,14,21],[14,22,14,23],[14,24,14,25],[14,26,14,27],[30,1,30,3],[30,26,30,27],[30,16,30,17],[30,18,30,19],[30,20,30,21],[30,22,30,23],[30,24,30,25],[30,6,30,7],[30,8,30,9],[30,10,30,11],[30,12,30,13],[30,14,30,15],[14,1,14,3],[14,4,14,5],[14,6,14,7],[14,8,14,9],[14,10,14,11],[14,12,14,13],[14,14,14,15],[14,16,14,17]]}
[]
["⑴","自分の","年齢",null,65,"歳",{"$f":"E2+1","v":66},"歳",{"$f":"G2+1","v":67},"歳",{"$f":"I2+1","v":68},"歳",{"$f":"K2+1","v":69},"歳",{"$f":"M2+1","v":70},"歳",{"$f":"O2+1","v":71},"歳",{"$f":"Q2+1","v":72},"歳",{"$f":"S2+1","v":73},"歳",{"$f":"U2+1","v":74},"歳",{"$f":"W2+1","v":75},"歳",{"$f":"Y2+1","v":76},"歳",null,"繰上下げ率"]
[null,null,null,"西暦",2024,null,2025,null,2026,null,2027,null,2028,null,2029,null,2030,null,2031,null,2032,null,2033,null,2034,null,2035,null,null,60]
[null,null,null,"誕生月",{"$f":"'65歳①'!C5","v":12},"月",{"$f":"E4","v":12},"月",{"$f":"E4","v":12},"月",{"$f":"E4","v":12},"月",{"$f":"E4","v":12},"月",{"$f":"E4","v":12},"月",{"$f":"E4","v":12},"月",{"$f":"E4","v":12},"月",{"$f":"E4","v":12},"月",{"$f":"E4","v":12},"月",{"$f":"E4","v":12},"月",{"$f":"G4","v":12},"月",null,61]
[null,null,null,"繰下率",1,null,1.0840000000000001,null,1.1679999999999999,null,1.252,null,1.3360000000000001,null,1.42,null,1.504,null,1.5880000000000001,null,1.6719999999999999,null,1.756,null,1.84,null,1.84,null,null,62]
["➊","老齢基礎年金額",null,null,{"$f":"IF('65歳②'!D22=0,'65歳②'!D5,\" \")","v":" "},null,{"$f":"IF(E6<\" \",E6,IF('65歳②'!D24=66,'65歳②'!D5*'65歳③'!G5,\" \"))","v":" "},null,{"$f":"IF(G6<\" \",G6,IF('65歳②'!D24=67,'65歳②'!D5*'65歳③'!I5,\" \"))","v":908470.39999999991},null,{"$f":"IF(I6<\" \",I6,IF('65歳②'!D24=68,'65歳②'!D5*'65歳③'!K5,\" \"))","v":908470.39999999991},null,{"$f":"IF(K6<\" \",K6,IF('65歳②'!D24=69,'65歳②'!D5*'65歳③'!M5,\" \"))","v":908470.39999999991},null,{"$f":"IF(M6<\" \",M6,IF('65歳②'!D24=70,'65歳②'!D5*'65歳③'!O5,\" \"))","v":908470.39999999991},null,{"$f":"IF(O6<\" \",O6,IF('65歳②'!D24=71,'65歳②'!D5*'65歳③'!Q5,\" \"))","v":908470.39999999991},null,{"$f":"IF(Q6<\" \",Q6,IF('65歳②'!D24=72,'65歳②'!D5*'65歳③'!S5,\" \"))","v":908470.39999999991},null,{"$f":"IF(S6<\" \",S6,IF('65歳②'!D24=73,'65歳②'!D5*'65歳③'!U5,\" \"))","v":908470.39999999991},null,{"$f":"IF(U6<\" \",U6,IF('65歳②'!D24=74,'65歳②'!D5*'65歳③'!W5,\" \"))","v":908470.39999999991},null,{"$f":"IF(W6<\" \",W6,IF('65歳②'!D24=75,'65歳②'!D5*'65歳③'!Y5,\" \"))","v":908470.39999999991},null,{"$f":"Y6","v":908470.39999999991},null,null,63]
[null,"振替加算",null,null,{"$f":"IF(E20<65,\" \",IF('65歳②'!D24=65,'65歳②'!S31,\" \"))","v":" "},null,{"$f":"IF(E7<\" \",E7,IF(G20<65,\" \",IF('65歳②'!L38=0,\" \",IF('65歳②'!D24>66,\" \",IF('65歳②'!D24>=65,'65歳②'!S31,\" \")))))","v":" "},null,{"$f":"IF(G7<\" \",G7,IF(I20<65,\" \",IF('65歳②'!L38=0,\" \",IF('65歳②'!D24>67,\" \",IF('65歳②'!D24>=65,'65歳②'!S31,\" \")))))","v":" "},null,{"$f":"IF(I7<\" \",I7,IF(K20<65,\" \",IF('65歳②'!L38=0,\" \",IF('65歳②'!D24>68,\" \",IF('65歳②'!D24>=65,'65歳②'!S31,\" \")))))","v":" "},null,{"$f":"IF(K7<\" \",K7,IF(M20<65,\" \",IF('65歳②'!L38=0,\" \",IF('65歳②'!D24>69,\" \",IF('65歳②'!D24>=65,'65歳②'!S31,\" \")))))","v":" "},null,{"$f":"IF(M7<\" \",M7,IF(O20<65,\" \",IF('65歳②'!L38=0,\" \",IF('65歳②'!D24>70,\" \",IF('65歳②'!D24>=65,'65歳②'!S31,\" \")))))","v":" "},null,{"$f":"IF(O7<\" \",O7,IF(Q20<65,\" \",IF('65歳②'!L38=0,\" \",IF('65歳②'!D24>71,\" \",IF('65歳②'!D24>=65,'65歳②'!S31,\" \")))))","v":" "},null,{"$f":"IF(Q7<\" \",Q7,IF(S20<65,\" \",IF('65歳②'!L38=0,\" \",IF('65歳②'!D24>72,\" \",IF('65歳②'!D24>=65,'65歳②'!S31,\" \")))))","v":" "},null,{"$f":"IF(S7<\" \",S7,IF(U20<65,\" \",IF('65歳②'!L38=0,\" \",IF('65歳②'!D24>73,\" \",IF('65歳②'!D24>=65,'65歳②'!S31,\" \")))))","v":" "},null,{"$f":"IF(U7<\" \",U7,IF(W20<65,\" \",IF('65歳②'!L38=0,\" \",IF('65歳②'!D24>74,\" \",IF('65歳②'!D24>=65,'65歳②'!S31,\" \")))))","v":" "},null,{"$f":"IF(W7<\" \",W7,IF(Y20<65,\" \",IF('65歳②'!L38=0,\" \",IF('65歳②'!D24>75,\" \",IF('65歳②'!D24>=65,'65歳②'!S31,\" \")))))","v":" "},null,{"$f":"IF(Y7<\" \",Y7,IF(AA20<65,\" \",IF('65歳②'!L38=0,\" \",IF('65歳②'!D24>76,\" \",IF('65歳②'!D24>=65,'65歳②'!S31,\" \")))))","v":" "},null,null,64]
[null,"小計",null,null,{"$f":"IF(E7=\" \",E6,E6+E7)","v":" "},null,{"$f":"IF(G7=\" \",G6,G6+G7)","v":" "},null,{"$f":"IF(I7=\" \",I6,I6+I7)","v":908470.39999999991},null,{"$f":"IF(K7=\" \",K6,K6+K7)","v":908470.39999999991},null,{"$f":"IF(M7=\" \",M6,M6+M7)","v":908470.39999999991},null,{"$f":"IF(O7=\" \",O6,O6+O7)","v":908470.39999999991},null,{"$f":"IF(Q7=\" \",Q6,Q6+Q7)","v":908470.39999999991},null,{"$f":"IF(S7=\" \",S6,S6+S7)","v":908470.39999999991},null,{"$f":"IF(U7=\" \",U6,U6+U7)","v":908470.39999999991},null,{"$f":"IF(W7=\" \",W6,W6+W7)","v":908470.39999999991},null,{"$f":"IF(Y7=\" \",Y6,Y6+Y7)","v":908470.39999999991},null,{"$f":"IF(AA7=\" \",AA6,AA6+AA7)","v":908470.39999999991},null,null,65,1]
[null,null,null,null,null,null,null,null,null,null,null,null,null,null,null,null,null,null,null,null,null,null,null,null,null,null,null,null,null,66,1.0840000000000001]
["❷","老齢厚生年金額",null,null,{"$f":"IF('65歳②'!D28=0,'65歳②'!F7,\" \")","v":" "},null,{"$f":"IF(E10<\" \",E10,IF('65歳②'!D30=66,('65歳②'!F7*G5*IF('65歳②'!D28=0,1,1-('65歳②'!F7+'65歳②'!D38+'65歳②'!H41-'65歳②'!D44*12)/2/'65歳②'!F7)),\" \"))","v":1811216.8678128},null,{"$f":"IF(G10<\" \",G10,IF('65歳②'!D30=67,('65歳②'!F7*I5*IF('65歳②'!D28=0,1,1-('65歳②'!F7+'65歳②'!D38+'65歳②'!H41-'65歳②'!D44*12)/2/'65歳②'!F7)),\" \"))","v":1811216.8678128},null,{"$f":"IF(I10<\" \",I10,IF('65歳②'!D30=68,('65歳②'!F7*K5*IF('65歳②'!D28=0,1,1-('65歳②'!F7+'65歳②'!D38+'65歳②'!H41-'65歳②'!D44*12)/2/'65歳②'!F7)),\" \"))","v":1811216.8678128},null,{"$f":"IF(K10<\" \",K10,IF('65歳②'!D30=69,('65歳②'!F7*M5*IF('65歳②'!D28=0,1,1-('65歳②'!F7+'65歳②'!D38+'65歳②'!H41-'65歳②'!D44*12)/2/'65歳②'!F7)),\" \"))","v":1811216.8678128},null,{"$f":"IF(M10<\" \",M10,IF('65歳②'!D30=70,('65歳②'!F7*O5*IF('65歳②'!D28=0,1,1-('65歳②'!F7+'65歳②'!D38+'65歳②'!H41-'65歳②'!D44*12)/2/'65歳②'!F7)),\" \"))","v":1811216.8678128},null,{"$f":"IF(O10<\" \",O10,IF('65歳②'!D30=71,('65歳②'!F7*Q5*IF('65歳②'!D28=0,1,1-('65歳②'!F7+'65歳②'!D38+'65歳②'!H41-'65歳②'!D44*12)/2/'65歳②'!F7)),\" \"))","v":1811216.8678128},null,{"$f":"IF(Q10<\" \",Q10,IF('65歳②'!D30=72,('65歳②'!F7*S5*IF('65歳②'!D28=0,1,1-('65歳②'!F7+'65歳②'!D38+'65歳②'!H41-'65歳②'!D44*12)/2/'65歳②'!F7)),\" \"))","v":1811216.8678128},null,{"$f":"IF(S10<\" \",S10,IF('65歳②'!D30=73,('65歳②'!F7*U5*IF('65歳②'!D28=0,1,1-('65歳②'!F7+'65歳②'!D38+'65歳②'!H41-'65歳②'!D44*12)/2/'65歳②'!F7)),\" \"))","v":1811216.8678128},null,{"$f":"IF(U10<\" \",U10,IF('65歳②'!D30=74,('65歳②'!F7*W5*IF('65歳②'!D28=0,1,1-('65歳②'!F7+'65歳②'!D38+'65歳②'!H41-'65歳②'!D44*12)/2/'65歳②'!F7)),\" \"))","v":1811216.8678128},null,{"$f":"IF(W10<\" \",W10,IF('65歳②'!D30=75,('65歳②'!F7*Y5*IF('65歳②'!D28=0,1,1-('65歳②'!F7+'65歳②'!D38+'65歳②'!H41-'65歳②'!D44*12)/2/'65歳②'!F7)),\" \"))","v":1811216.8678128},null,{"$f":"IF(Y10<\" \",Y10,IF('65歳②'!D30=75,('65歳②'!F7*AA5*IF('65歳②'!D28=0,1,1-('65歳②'!F7+'65歳②'!D38+'65歳②'!H41-'65歳②'!D44*12)/2/'65歳②'!F7)),\" \"))","v":1811216.8678128},null,null,67,1.1679999999999999]
[null,"定時改定増加見込額",null,null,null,null,{"$f":"IF('65歳②'!D34=0,0,IF('65歳②'!D36<G2,IF(G10=\" \",\" \",VLOOKUP('65歳②'!D36,'65歳②'!G41:H52,2,FALSE)),IF(G10=\" \",\" \",'65歳②'!H41)))","v":18271.461599999999},null,{"$f":"IF('65歳②'!D34=0,0,IF('65歳②'!D36<I2,IF(I10=\" \",\" \",VLOOKUP('65歳②'!D36,'65歳②'!G41:H52,2,FALSE)),IF(I10=\" \",\" \",'65歳②'!H42)))","v":36542.923199999997},null,{"$f":"IF('65歳②'!D34=0,0,IF('65歳②'!D36<K2,IF(K10=\" \",\" \",VLOOKUP('65歳②'!D36,'65歳②'!G41:H52,2,FALSE)),IF(K10=\" \",\" \",'65歳②'!H43)))","v":54814.3848},null,{"$f":"IF('65歳②'!D34=0,0,IF('65歳②'!D36<M2,IF(M10=\" \",\" \",VLOOKUP('65歳②'!D36,'65歳②'!G41:H52,2,FALSE)),IF(M10=\" \",\" \",'65歳②'!H44)))","v":73085.846399999995},null,{"$f":"IF('65歳②'!D34=0,0,IF('65歳②'!D36<O2,IF(O10=\" \",\" \",VLOOKUP('65歳②'!D36,'65歳②'!G41:H52,2,FALSE)),IF(O10=\" \",\" \",'65歳②'!H45)))","v":91357.308000000005},null,{"$f":"IF('65歳②'!D34=0,0,IF('65歳②'!D36<Q2,IF(Q10=\" \",\" \",VLOOKUP('65歳②'!D36,'65歳②'!G41:H52,2,FALSE)),IF(Q10=\" \",\" \",'65歳②'!H46)))","v":91357.308000000005},null,{"$f":"IF('65歳②'!D34=0,0,IF('65歳②'!D36<S2,IF(S10=\" \",\" \",VLOOKUP('65歳②'!D36,'65歳②'!G41:H52,2,FALSE)),IF(S10=\" \",\" \",'65歳②'!H47)))","v":91357.308000000005},null,{"$f":"IF('65歳②'!D34=0,0,IF('65歳②'!D36<U2,IF(U10=\" \",\" \",VLOOKUP('65歳②'!D36,'65歳②'!G41:H52,2,FALSE)),IF(U10=\" \",\" \",'65歳②'!H48)))","v":91357.308000000005},null,{"$f":"IF('65歳②'!D34=0,0,IF('65歳②'!D36<W2,IF(W10=\" \",\" \",VLOOKUP('65歳②'!D36,'65歳②'!G41:H52,2,FALSE)),IF(W10=\" \",\" \",'65歳②'!H49)))","v":91357.308000000005},null,{"$f":"IF('65歳②'!D34=0,0,IF('65歳②'!D36<Y2,IF(Y10=\" \",\" \",VLOOKUP('65歳②'!D36,'65歳②'!G41:H52,2,FALSE)),IF(Y10=\" \",\" \",'65歳②'!H50)))","v":91357.308000000005},null,{"$f":"IF('65歳②'!D34=0,0,IF('65歳②'!D36<AA2,IF(AA10=\" \",\" \",VLOOKUP('65歳②'!D36,'65歳②'!G41:H52,2,FALSE)),IF(AA10=\" \",\" \",'65歳②'!H51)))","v":91357.308000000005}]
[null,"在職支給停止見込額",null,null,{"$f":"IF(E10=\" \",\" \",IF('65歳②'!D34=0,0,IF((('65歳②'!F7+'65歳②'!D38)-'65歳②'!D44*12)/2<0,0,(('65歳②'!F7+'65歳②'!D38)-'65歳②'!D44*12)/2)))","v":" "},null,{"$f":"IF(G10=\" \",\" \",IF('65歳②'!D34=0,0,IF((('65歳②'!F7+'65歳②'!D38+G11)-'65歳②'!D44*12)/2<0,0,(('65歳②'!F7+'65歳②'!D38+G11)-'65歳②'!D44*12)/2)))","v":0},null,{"$f":"IF(I10=\" \",\" \",IF('65歳②'!D34=0,0,IF((('65歳②'!F7+'65歳②'!D38+I11)-'65歳②'!D44*12)/2<0,0,(('65歳②'!F7+'65歳②'!D38+I11)-'65歳②'!D44*12)/2)))","v":0},null,{"$f":"IF(K10=\" \",\" \",IF('65歳②'!D34=0,0,IF((('65歳②'!F7+'65歳②'!D38+K11)-'65歳②'!D44*12)/2<0,0,(('65歳②'!F7+'65歳②'!D38+K11)-'65歳②'!D44*12)/2)))","v":0},null,{"$f":"IF(M10=\" \",\" \",IF('65歳②'!D34=0,0,IF((('65歳②'!F7+'65歳②'!D38+M11)-'65歳②'!D44*12)/2<0,0,(('65歳②'!F7+'65歳②'!D38+M11)-'65歳②'!D44*12)/2)))","v":0},null,{"$f":"IF(O10=\" \",\" \",IF('65歳②'!D34=0,0,IF((('65歳②'!F7+'65歳②'!D38+O11)-'65歳②'!D44*12)/2<0,0,(('65歳②'!F7+'65歳②'!D38+O11)-'65歳②'!D44*12)/2)))","v":0},null,{"$f":"IF(Q10=\" \",\" \",IF('65歳②'!D34=0,0,IF((('65歳②'!F7+'65歳②'!D38+Q11)-'65歳②'!D44*12)/2<0,0,(('65歳②'!F7+'65歳②'!D38+Q11)-'65歳②'!D44*12)/2)))","v":0},null,{"$f":"IF(S10=\" \",\" \",IF('65歳②'!D34=0,0,IF((('65歳②'!F7+'65歳②'!D38+S11)-'65歳②'!D44*12)/2<0,0,(('65歳②'!F7+'65歳②'!D38+S11)-'65歳②'!D44*12)/2)))","v":0},null,{"$f":"IF(U10=\" \",\" \",IF('65歳②'!D34=0,0,IF((('65歳②'!F7+'65歳②'!D38+U11)-'65歳②'!D44*12)/2<0,0,(('65歳②'!F7+'65歳②'!D38+U11)-'65歳②'!D44*12)/2)))","v":0},null,{"$f":"IF(W10=\" \",\" \",IF('65歳②'!D34=0,0,IF((('65歳②'!F7+'65歳②'!D38+W11)-'65歳②'!D44*12)/2<0,0,(('65歳②'!F7+'65歳②'!D38+W11)-'65歳②'!D44*12)/2)))","v":0},null,{"$f":"IF(Y10=\" \",\" \",IF('65歳②'!D34=0,0,IF((('65歳②'!F7+'65歳②'!D38+Y11)-'65歳②'!D44*12)/2<0,0,(('65歳②'!F7+'65歳②'!D38+Y11)-'65歳②'!D44*12)/2)))","v":0},null,{"$f":"IF(AA10=\" \",\" \",IF('65歳②'!D34=0,0,IF((('65歳②'!F7+'65歳②'!D38+AA11)-'65歳②'!D44*12)/2<0,0,(('65歳②'!F7+'65歳②'!D38+AA11)-'65歳②'!D44*12)/2)))","v":0}]
[null,"経過的加算(変動有)",null,null,{"$f":"IF(E10=\" \",\" \",'65歳②'!F9)","v":" "},null,{"$f":"IF(E13<\" \",E13,IF('65歳②'!D30=66,'65歳②'!F9*G5,\" \"))","v":6070.4000000000005},null,{"$f":"IF(G13<\" \",G13,IF('65歳②'!D30=67,'65歳②'!F9*I5,\" \"))","v":6070.4000000000005},null,{"$f":"IF(I13<\" \",I13,IF('65歳②'!D30=68,'65歳②'!F9*K5,\" \"))","v":6070.4000000000005},null,{"$f":"IF(K13<\" \",K13,IF('65歳②'!D30=69,'65歳②'!F9*M5,\" \"))","v":6070.4000000000005},null,{"$f":"IF(M13<\" \",M13,IF('65歳②'!D30=70,'65歳②'!F9*O5,\" \"))","v":6070.4000000000005},null,{"$f":"IF(O13<\" \",O13,IF('65歳②'!D30=71,'65歳②'!F9*Q5,\" \"))","v":6070.4000000000005},null,{"$f":"IF(Q13<\" \",Q13,IF('65歳②'!D30=72,'65歳②'!F9*S5,\" \"))","v":6070.4000000000005},null,{"$f":"IF(S13<\" \",S13,IF('65歳②'!D30=73,'65歳②'!F9*U5,\" \"))","v":6070.4000000000005},null,{"$f":"IF(U13<\" \",U13,IF('65歳②'!D30=74,'65歳②'!F9*W5,\" \"))","v":6070.4000000000005},null,{"$f":"IF(W13<\" \",W13,IF('65歳②'!D30=75,'65歳②'!F9*Y5,\" \"))","v":6070.4000000000005},null,{"$f":"Y13","v":6070.4000000000005},null,null,68,1.252]
[null,"配偶者加給年金",null,null,{"$f":"IF(E10=\" \",\" \",IF(E20>=65,\" \",IF('65歳②'!L36=0,IF('65歳①'!C12=2,IF(E20<VLOOKUP(E20,'65歳②'!Q38:S54,3,FALSE),'65歳②'!O37,\" \"),IF(E20<VLOOKUP(E20,'65歳②'!Q38:S54,2,FALSE),'65歳②'!O37,\" \")),'65歳②'!O37)))","v":" "},null,{"$f":"IF(G10=\" \",\" \",IF(G20>=65,\" \",IF('65歳②'!L36=0,IF('65歳①'!C12=2,IF(G20<VLOOKUP(E20,'65歳②'!Q38:S54,3,FALSE),'65歳②'!O37,\" \"),IF(G20<VLOOKUP(E20,'65歳②'!Q38:S54,2,FALSE),'65歳②'!O37,\" \")),'65歳②'!O37)))","v":408100},null,{"$f":"IF(I10=\" \",\" \",IF(I20>=65,\" \",IF('65歳②'!L36=0,IF('65歳①'!C12=2,IF(I20<VLOOKUP(E20,'65歳②'!Q38:S54,3,FALSE),'65歳②'!O37,\" \"),IF(I20<VLOOKUP(E20,'65歳②'!Q38:S54,2,FALSE),'65歳②'!O37,\" \")),'65歳②'!O37)))","v":408100},null,{"$f":"IF(K10=\" \",\" \",IF(K20>=65,\" \",IF('65歳②'!L36=0,IF('65歳①'!C12=2,IF(K20<VLOOKUP(E20,'65歳②'!Q38:S54,3,FALSE),'65歳②'!O37,\" \"),IF(K20<VLOOKUP(E20,'65歳②'!Q38:S54,2,FALSE),'65歳②'!O37,\" \")),'65歳②'!O37)))","v":408100},null,{"$f":"IF(M10=\" \",\" \",IF(M20>=65,\" \",IF('65歳②'!L36=0,IF('65歳①'!C12=2,IF(M20<VLOOKUP(E20,'65歳②'!Q38:S54,3,FALSE),'65歳②'!O37,\" \"),IF(M20<VLOOKUP(E20,'65歳②'!Q38:S54,2,FALSE),'65歳②'!O37,\" \")),'65歳②'!O37)))","v":408100},null,{"$f":"IF(O10=\" \",\" \",IF(O20>=65,\" \",IF('65歳②'!L36=0,IF('65歳①'!C12=2,IF(O20<VLOOKUP(E20,'65歳②'!Q38:S54,3,FALSE),'65歳②'!O37,\" \"),IF(O20<VLOOKUP(E20,'65歳②'!Q38:S54,2,FALSE),'65歳②'!O37,\" \")),'65歳②'!O37)))","v":408100},null,{"$f":"IF(Q10=\" \",\" \",IF(Q20>=65,\" \",IF('65歳②'!L36=0,IF('65歳①'!C12=2,IF(Q20<VLOOKUP(E20,'65歳②'!Q38:S54,3,FALSE),'65歳②'!O37,\" \"),IF(Q20<VLOOKUP(E20,'65歳②'!Q38:S54,2,FALSE),'65歳②'!O37,\" \")),'65歳②'!O37)))","v":408100},null,{"$f":"IF(S10=\" \",\" \",IF(S20>=65,\" \",IF('65歳②'!L36=0,IF('65歳①'!C12=2,IF(S20<VLOOKUP(E20,'65歳②'!Q38:S54,3,FALSE),'65歳②'!O37,\" \"),IF(S20<VLOOKUP(E20,'65歳②'!Q38:S54,2,FALSE),'65歳②'!O37,\" \")),'65歳②'!O37)))","v":" "},null,{"$f":"IF(U10=\" \",\" \",IF(U20>=65,\" \",IF('65歳②'!L36=0,IF('65歳①'!C12=2,IF(U20<VLOOKUP(E20,'65歳②'!Q38:S54,3,FALSE),'65歳②'!O37,\" \"),IF(U20<VLOOKUP(E20,'65歳②'!Q38:S54,2,FALSE),'65歳②'!O37,\" \")),'65歳②'!O37)))","v":" "},null,{"$f":"IF(W10=\" \",\" \",IF(W20>=65,\" \",IF('65歳②'!L36=0,IF('65歳①'!C12=2,IF(W20<VLOOKUP(E20,'65歳②'!Q38:S54,3,FALSE),'65歳②'!O37,\" \"),IF(W20<VLOOKUP(E20,'65歳②'!Q38:S54,2,FALSE),'65歳②'!O37,\" \")),'65歳②'!O37)))","v":" "},null,{"$f":"IF(Y10=\" \",\" \",IF(Y20>=65,\" \",IF('65歳②'!L36=0,IF('65歳①'!C12=2,IF(Y20<VLOOKUP(E20,'65歳②'!Q38:S54,3,FALSE),'65歳②'!O37,\" \"),IF(Y20<VLOOKUP(E20,'65歳②'!Q38:S54,2,FALSE),'65歳②'!O37,\" \")),'65歳②'!O37)))","v":" "},null,{"$f":"IF(AA10=\" \",\" \",IF(AA20>=65,\" \",IF('65歳②'!L36=0,IF('65歳①'!C12=2,IF(AA20<VLOOKUP(E20,'65歳②'!Q38:S54,3,FALSE),'65歳②'!O37,\" \"),IF(AA20<VLOOKUP(E20,'65歳②'!Q38:S54,2,FALSE),'65歳②'!O37,\" \")),'65歳②'!O37)))","v":" "},null,null,69,1.3360000000000001]
[null,"小計",null,null,{"$f":"IF(E10=\" \",\" \",IF(E14=\" \",E10-E12+E13,E10-E12+E13+E14))","v":" "},null,{"$f":"IF(G10=\" \",\" \",IF(G14=\" \",G10-G12+G13,G10-G12+G13+G14))","v":2225387.2678127997},null,{"$f":"IF(I10=\" \",\" \",IF(I14=\" \",I10-I12+I13,I10-I12+I13+I14))","v":2225387.2678127997},null,{"$f":"IF(K10=\" \",\" \",IF(K14=\" \",K10-K12+K13,K10-K12+K13+K14))","v":2225387.2678127997},null,{"$f":"IF(M10=\" \",\" \",IF(M14=\" \",M10-M12+M13,M10-M12+M13+M14))","v":2225387.2678127997},null,{"$f":"IF(O10=\" \",\" \",IF(O14=\" \",O10-O12+O13,O10-O12+O13+O14))","v":2225387.2678127997},null,{"$f":"IF(Q10=\" \",\" \",IF(Q14=\" \",Q10-Q12+Q13,Q10-Q12+Q13+Q14))","v":2225387.2678127997},null,{"$f":"IF(S10=\" \",\" \",IF(S14=\" \",S10-S12+S13,S10-S12+S13+S14))","v":1817287.2678127999},null,{"$f":"IF(U10=\" \",\" \",IF(U14=\" \",U10-U12+U13,U10-U12+U13+U14))","v":1817287.2678127999},null,{"$f":"IF(W10=\" \",\" \",IF(W14=\" \",W10-W12+W13,W10-W12+W13+W14))","v":1817287.2678127999},null,{"$f":"IF(Y10=\" \",\" \",IF(Y14=\" \",Y10-Y12+Y13,Y10-Y12+Y13+Y14))","v":1817287.2678127999},null,{"$f":"IF(AA10=\" \",\" \",IF(AA14=\" \",AA10-AA12+AA13,AA10-AA12+AA13+AA14))","v":1817287.2678127999},null,null,70,1.42]
{"$rows_left_out":35}